Target
Apelin receptor
Ligand
BDBM447911
Substrate
Meas. Tech.
GTPγS Binding
EC50
2.60±n/a nM
Citation
 Chen, YCheng, ACDebenedetto, MVDransfield, PJHarvey, JSHouze, JKhakoo, AYLai, SMa, ZPattaropong, VSwaminath, GKreiman, CMoebius, DCSharma, A Triazole pyridyl compounds as agonists of the APJ receptor US Patent  US10689367 Publication Date 6/23/2020 
Target
Name:
Apelin receptor
Synonyms:
AGTRL1 APJ_HUMAN Angiotensin receptor-like 1 Apelin receptor (APJ) G-protein coupled receptor HG11
Type:
Enzyme Catalytic Domain
Mol. Mass.:
42664.06
Organism:
Homo sapiens (Human)
Description:
P35414
Residue:
380
  
Inhibitor
Name:
BDBM447911
Synonyms:
US10689367, Example 239.0 | US10689367, Example 240.0
Type:
Small organic molecule
Emp. Form.:
C24H31N9O5S
Mol. Mass.:
557.625
SMILES:
COc1cccc(n1)-c1nnc(NS(=O)(=O)[C@@H](C)[C@@H](OC(C)C)c2ncc(C)cn2)n1[C@@H](C)c1nc(C)no1
: