Target
Nuclear receptor ROR-gamma
Ligand
BDBM448026
Substrate
Meas. Tech.
Biological Assay for RORgammaT Activity
IC50
2.00±n/a nM
Citation
 Lapointe, BTFuller, PHGunaydin, HLiu, KScott, METrotter, BWZhang, H Substituted indazole compounds as RORgammaT inhibitors and uses thereof US Patent  US10689369 Publication Date 6/23/2020 
Target
Name:
Nuclear receptor ROR-gamma
Synonyms:
NR1F3 Nuclear receptor ROR-gamma (RORC) RAR-related orphan receptor C (RORc) RORG RZRG Retinoid-related orphan receptor-gamma (RORc)
Type:
Enzyme Catalytic Domain
Mol. Mass.:
58218.40
Organism:
Homo sapiens (Human)
Description:
P51449
Residue:
518
  
Inhibitor
Name:
BDBM448026
Synonyms:
US10689369, Example 2A
Type:
Small organic molecule
Emp. Form.:
C31H35ClN4O4
Mol. Mass.:
563.087
SMILES:
CN1CC2(C1)CN(C2)C(=O)C1CCc2c(C1)n(nc2C1=CCC(CC1)C(O)=O)C(=O)c1c(Cl)cccc1C1CC1
: