Target
Nuclear receptor ROR-gamma
Ligand
BDBM385456
Substrate
Meas. Tech.
Biological Assay for RORgammaT Activity
IC50
1.000±n/a nM
Citation
 Lapointe, BTFuller, PHGunaydin, HLiu, KScott, METrotter, BWZhang, H Substituted indazole compounds as RORgammaT inhibitors and uses thereof US Patent  US10689369 Publication Date 6/23/2020 
Target
Name:
Nuclear receptor ROR-gamma
Synonyms:
NR1F3 Nuclear receptor ROR-gamma (RORC) RAR-related orphan receptor C (RORc) RORG RZRG Retinoid-related orphan receptor-gamma (RORc)
Type:
Enzyme Catalytic Domain
Mol. Mass.:
58218.40
Organism:
Homo sapiens (Human)
Description:
P51449
Residue:
518
  
Inhibitor
Name:
BDBM385456
Synonyms:
US10287272, Example 5A | US10689369, Example 5A
Type:
Small organic molecule
Emp. Form.:
C34H39ClF3N3O5
Mol. Mass.:
662.139
SMILES:
COC1CN(C1)C(=O)C1CCc2c(C1)n(nc2C1=CCC(CC1)C(=O)OC(C)(C)C)C(=O)c1c(Cl)cccc1C1(CC1)C(F)(F)F
: