Target
Nuclear receptor ROR-gamma
Ligand
BDBM448155
Substrate
Meas. Tech.
Biological Assay for RORgammaT Activity
IC50
92.0±n/a nM
Citation
 Lapointe, BTFuller, PHGunaydin, HLiu, KScott, METrotter, BWZhang, H Substituted indazole compounds as RORgammaT inhibitors and uses thereof US Patent  US10689369 Publication Date 6/23/2020 
Target
Name:
Nuclear receptor ROR-gamma
Synonyms:
NR1F3 Nuclear receptor ROR-gamma (RORC) RAR-related orphan receptor C (RORc) RORG RZRG Retinoid-related orphan receptor-gamma (RORc)
Type:
Enzyme Catalytic Domain
Mol. Mass.:
58218.40
Organism:
Homo sapiens (Human)
Description:
P51449
Residue:
518
  
Inhibitor
Name:
BDBM448155
Synonyms:
US10689369, Example 13A
Type:
Small organic molecule
Emp. Form.:
C30H31ClF3N3O5
Mol. Mass.:
606.032
SMILES:
OC1CCN(C1)C(=O)[C@@H]1CCc2c(C1)n(nc2C1=CCC(CC1)C(O)=O)C(=O)c1c(Cl)cccc1C1(CC1)C(F)(F)F
: