Target
Orexin/Hypocretin receptor type 1
Ligand
BDBM185306
Substrate
Meas. Tech.
FLIPR Assay
IC50
14.0±n/a nM
Citation
 Fieldhouse, CGlen, AMaine, SFujimoto, TRobinson, JS 1,2-substituted cyclopentanes as orexin receptor antagonists US Patent  US10689373 Publication Date 6/23/2020 
Target
Name:
Orexin/Hypocretin receptor type 1
Synonyms:
HCRTR1 OX1R_HUMAN Orexin receptor type 1 (OR 1) Orexin receptor type 1 (OX1) Orexin receptor type 1 (OxR1) | Ox1r
Type:
Protein
Mol. Mass.:
47554.50
Organism:
Homo sapiens (Human)
Description:
O43613
Residue:
425
  
Inhibitor
Name:
BDBM185306
Synonyms:
US10011588, Example 125 US9156829, 125
Type:
Small organic molecule
Emp. Form.:
C20H21F3N8O
Mol. Mass.:
446.4289
SMILES:
CCc1nc(cnc1N[C@H]1CCC[C@@H]1NC(=O)c1ncccc1-n1nccn1)C(F)(F)F
: