Target
Sigma non-opioid intracellular receptor 1
Ligand
BDBM448118
Substrate
Meas. Tech.
Radioligand Assay
Ki
>500±n/a nM
Citation
 Virgili-Bernado, MAlmansa-Rosales, CAlegret-Molina, C OXA-Diazaspiro compounds having activity against pain US Patent  US10689398 Publication Date 6/23/2020 
Target
Name:
Sigma non-opioid intracellular receptor 1
Synonyms:
Aging-associated gene 8 protein SGMR1_HUMAN SIGMAR1 SR31747-binding protein Sigma 1-type opioid receptor Sigma1R | hSigmaR1
Type:
Enzyme Catalytic Domain
Mol. Mass.:
25124.85
Organism:
Homo sapiens (Human)
Description:
Q99720
Residue:
223
  
Inhibitor
Name:
BDBM448118
Synonyms:
(7-phenethyl-4-oxa- 7,12- diazadispiro[2.1.5.3] tridecan-12-yl)(phenyl) methanone | US10689398, Example 24
Type:
Small organic molecule
Emp. Form.:
C25H30N2O2
Mol. Mass.:
390.5179
SMILES:
O=C(N1CC2(CC2)OC2(CCCN(CCc3ccccc3)C2)C1)c1ccccc1
: