Target
Sigma non-opioid intracellular receptor 1
Ligand
BDBM448176
Substrate
Meas. Tech.
Radioligand Assay
Ki
<100±n/a nM
Citation
 Virgili-Bernado, MAlmansa-Rosales, CAlegret-Molina, C OXA-Diazaspiro compounds having activity against pain US Patent  US10689398 Publication Date 6/23/2020 
Target
Name:
Sigma non-opioid intracellular receptor 1
Synonyms:
Aging-associated gene 8 protein SGMR1_HUMAN SIGMAR1 SR31747-binding protein Sigma 1-type opioid receptor Sigma1R | hSigmaR1
Type:
Enzyme Catalytic Domain
Mol. Mass.:
25124.85
Organism:
Homo sapiens (Human)
Description:
Q99720
Residue:
223
  
Inhibitor
Name:
BDBM448176
Synonyms:
7,12-dibenzyl-4-oxa-7,12- diazadispiro[2.1.5.3] tridecane(*) | US10689398, Example 78
Type:
Small organic molecule
Emp. Form.:
C24H30N2O
Mol. Mass.:
362.5078
SMILES:
C(N1CCCC2(C1)CN(Cc1ccccc1)CC1(CC1)O2)c1ccccc1
: