Target
Fibroblast growth factor receptor 2
Ligand
BDBM448228
Substrate
Meas. Tech.
Inhibition Kinase Activity Assay
IC50
12.0±n/a nM
Citation
 Nakanishi, YAkiyama, NNishito, Y FGFR3 fusion gene and pharmaceutical drug targeting same US Patent  US10689705 Publication Date 6/23/2020 
Target
Name:
Fibroblast growth factor receptor 2
Synonyms:
BEK FGFR-2 FGFR2 Fibroblast growth factor receptor 2 (FGFR2) KGFR Keratinocyte growth factor receptor VEGF-receptor 2 and Fibroblast growth factor receptor 2
Type:
Enzyme
Mol. Mass.:
92015.45
Organism:
Homo sapiens (Human)
Description:
P21802
Residue:
821
  
Inhibitor
Name:
BDBM448228
Synonyms:
US10689705, Compound 5
Type:
Small organic molecule
Emp. Form.:
C27H29N7O
Mol. Mass.:
467.5655
SMILES:
CC1CCC(C)N1Cc1ccc2[nH]c(cc2c1)C(=O)c1cnn(c1N)-c1ccc2nc(C)[nH]c2c1
: