Target
Fibroblast growth factor receptor 2
Ligand
BDBM448249
Substrate
Meas. Tech.
Inhibition Kinase Activity Assay
IC50
5.50±n/a nM
Citation
 Nakanishi, YAkiyama, NNishito, Y FGFR3 fusion gene and pharmaceutical drug targeting same US Patent  US10689705 Publication Date 6/23/2020 
Target
Name:
Fibroblast growth factor receptor 2
Synonyms:
BEK FGFR-2 FGFR2 Fibroblast growth factor receptor 2 (FGFR2) KGFR Keratinocyte growth factor receptor VEGF-receptor 2 and Fibroblast growth factor receptor 2
Type:
Enzyme
Mol. Mass.:
92015.45
Organism:
Homo sapiens (Human)
Description:
P21802
Residue:
821
  
Inhibitor
Name:
BDBM448249
Synonyms:
US10689705, Compound 26
Type:
Small organic molecule
Emp. Form.:
C25H18FN7O
Mol. Mass.:
451.4551
SMILES:
Cc1nc2cc(ccc2[nH]1)-n1ncc(C(=O)c2cc3ccc(cc3[nH]2)-c2ccc(F)cn2)c1N
: