Target
5-hydroxytryptamine receptor 2A
Ligand
BDBM194794
Substrate
Meas. Tech.
Receptor Binding Assay
Ki
3.30±n/a nM
Citation
 Yamashita, HIto, NMiyamura, SOshima, KMatsubara, JKuroda, HTakahashi, HShimizu, STanaka, TOshiro, YTaira, S Piperazine-substituted benzothiophenes for treatment of mental disorders US Patent  USRE48059 Publication Date 6/23/2020 
Target
Name:
5-hydroxytryptamine receptor 2A
Synonyms:
5-HT-2A 5-HT2A 5-hydroxytryptamine receptor 2A (5HT2A) Htr2 Serotonin Receptor 2A
Type:
G Protein-Coupled Receptor (GPCR)
Mol. Mass.:
52852.05
Organism:
Rattus norvegicus (rat)
Description:
Rat cortex membranes 5-HT2A receptors.
Residue:
471
  
Inhibitor
Name:
BDBM194794
Synonyms:
US9206167, 15 | USRE48059, Compound of Example 15
Type:
Small organic molecule
Emp. Form.:
C25H27N3O2S
Mol. Mass.:
433.566
SMILES:
O=C1CCc2ccc(OC\C=C\CN3CCN(CC3)c3cccc4sccc34)cc2N1
: