Target
Replicase polyprotein 1ab
Ligand
BDBM448316
Substrate
Meas. Tech.
scanning fluorimetry assay of Vero E6 cells
EC50
540±130 nM
Citation
 Qiao, JLi, YSZeng, RLiu, FLLuo, RHHuang, CWang, YFZhang, JQuan, BShen, CMao, XLiu, XSun, WYang, WNi, XWang, KXu, LDuan, ZLZou, QCZhang, HLQu, WLong, YHLi, MHYang, RCLiu, XYou, JZhou, YYao, RLi, WPLiu, JMChen, PLiu, YLin, GFYang, XZou, JLi, LHu, YLu, GWLi, WMWei, YQZheng, YTLei, JYang, S SARS-CoV-2 Mpro inhibitors with antiviral activity in a transgenic mouse model Science 0:0 (2021)  
Target
Name:
Replicase polyprotein 1ab
Synonyms:
ORF1ab polyprotein pp1ab | rep
Type:
Protein
Mol. Mass.:
794070.71
Organism:
2019-nCoV
Description:
P0DTD1
Residue:
7096
  
Inhibitor
Name:
BDBM448316
Synonyms:
MI-30
Type:
Small organic molecule
Emp. Form.:
C23H27Cl2N3O5
Mol. Mass.:
496.384
SMILES:
Clc1ccc(OCC(=O)N2C[C@@H]3CCC[C@H]3[C@@H]2C(=O)N[C@@H](C[C@@H]2CCNC2=O)C=O)c(Cl)c1
: