Target
Plasma kallikrein
Ligand
BDBM448412
Substrate
Meas. Tech.
Inhibition Assay
Ki
2.00±n/a nM
Citation
 Eckhardt, MGollner, ALangkopf, EWagner, HWiedenmayer, D Heteroaromatic carboxamide derivatives as plasma kallikrein inhibitors US Patent  US10695334 Publication Date 6/30/2020 
Target
Name:
Plasma kallikrein
Synonyms:
Fletcher factor KLKB1 Kallikrein Plasma kallikrein heavy chain Plasma prekallikrein
Type:
Protein
Mol. Mass.:
71391.16
Organism:
Homo sapiens (Human)
Description:
P03952
Residue:
638
  
Inhibitor
Name:
BDBM448412
Synonyms:
1-({4-Methyl-2-[(1R,5S,6R)-6-methyl-3- | US10695334, Example 101
Type:
Small organic molecule
Emp. Form.:
C23H28N8O
Mol. Mass.:
432.5214
SMILES:
C[C@@H]1[C@@H]2CN(C[C@H]12)c1ncc(Cn2cnc(c2)C(=O)N[C@@H]2CCc3c(C)[nH]nc23)c(C)n1
: