Target
Plasma kallikrein
Ligand
BDBM448416
Substrate
Meas. Tech.
Inhibition Assay
Ki
1.000±n/a nM
Citation
 Eckhardt, MGollner, ALangkopf, EWagner, HWiedenmayer, D Heteroaromatic carboxamide derivatives as plasma kallikrein inhibitors US Patent  US10695334 Publication Date 6/30/2020 
Target
Name:
Plasma kallikrein
Synonyms:
Fletcher factor KLKB1 Kallikrein Plasma kallikrein heavy chain Plasma prekallikrein
Type:
Protein
Mol. Mass.:
71391.16
Organism:
Homo sapiens (Human)
Description:
P03952
Residue:
638
  
Inhibitor
Name:
BDBM448416
Synonyms:
1-[(6-{3-Azabicyclo[3.1.0]hexan-3-yl}-2-cyano- | US10695334, Example 105
Type:
Small organic molecule
Emp. Form.:
C23H24N8O
Mol. Mass.:
428.4897
SMILES:
Cc1[nH]nc2C(CCc12)NC(=O)c1cn(Cc2ccc(nc2C#N)N2CC3CC3C2)cn1
: