Target
Thymidine kinase, cytosolic
Ligand
BDBM448380
Substrate
Meas. Tech.
Inhibition Assay
IC50
>10000±n/a nM
Citation
 Eckhardt, MGollner, ALangkopf, EWagner, HWiedenmayer, D Heteroaromatic carboxamide derivatives as plasma kallikrein inhibitors US Patent  US10695334 Publication Date 6/30/2020 
Target
Name:
Thymidine kinase, cytosolic
Synonyms:
KITH_HUMAN | TK1
Type:
PROTEIN
Mol. Mass.:
25476.50
Organism:
Homo sapiens (Human)
Description:
ChEMBL_1333884
Residue:
234
  
Inhibitor
Name:
BDBM448380
Synonyms:
4-[(6-{3-Azabicyclo[3.1.0]hexan-3-yl}-2-methylpyridin-3-yl)methyl]-5-cyano-N-[(6R)-3-methyl-1H,4H,5H,6H-cyclopenta[c]pyrazol-6-yl]thiophene-2-carboxamide | US10695334, Example 8
Type:
Small organic molecule
Emp. Form.:
C25H26N6OS
Mol. Mass.:
458.579
SMILES:
Cc1n[nH]c2[C@@H](CCc12)NC(=O)c1cc(Cc2ccc(nc2C)N2CC3CC3C2)c(s1)C#N
: