Target
Thymidine kinase, cytosolic
Ligand
BDBM448395
Substrate
Meas. Tech.
Inhibition Assay
IC50
>10000±n/a nM
Citation
 Eckhardt, MGollner, ALangkopf, EWagner, HWiedenmayer, D Heteroaromatic carboxamide derivatives as plasma kallikrein inhibitors US Patent  US10695334 Publication Date 6/30/2020 
Target
Name:
Thymidine kinase, cytosolic
Synonyms:
KITH_HUMAN | TK1
Type:
PROTEIN
Mol. Mass.:
25476.50
Organism:
Homo sapiens (Human)
Description:
ChEMBL_1333884
Residue:
234
  
Inhibitor
Name:
BDBM448395
Synonyms:
7-[(2-{3-Azabicyclo[3.1.0]hexan-3-yl}-4-methyl- | US10695334, Example 23
Type:
Small organic molecule
Emp. Form.:
C25H27N9O
Mol. Mass.:
469.5416
SMILES:
Cc1n[nH]c2[C@@H](CCc12)NC(=O)c1cn(Cc2cnc(nc2C)N2CC3CC3C2)c2ncncc12
: