Target
Tyrosine-protein kinase JAK1 [837-1142]
Ligand
BDBM400514
Substrate
Meas. Tech.
In vitro JAK Kinase Assay
IC50
<5.00±n/a nM
Citation
 Huang, TXue, C Piperidin-4-yl azetidine derivatives as JAK1 inhibitors US Patent  US10695337 Publication Date 6/30/2020 
Target
Name:
Tyrosine-protein kinase JAK1 [837-1142]
Synonyms:
JAK1 JAK1A JAK1_HUMAN Tyrosine-protein kinase JAK1 (837-1142) | Tyrosine-protein kinase JAK1 (aa 837-1142)
Type:
Mol. Mass.:
35230.04
Organism:
Homo sapiens (Human)
Description:
P23458[837-1142]
Residue:
306
  
Inhibitor
Name:
BDBM400514
Synonyms:
US10695337, Example 270 US9999619, Example 270
Type:
Small organic molecule
Emp. Form.:
C27H24F3N7O
Mol. Mass.:
519.521
SMILES:
Fc1ccc(F)c(C(=O)N2CCC(CC2)N2CC(CC#N)(C2)n2ccc(c2)-c2ncnc3[nH]ccc23)c1F
: