Target
Tyrosine-protein kinase JAK1 [837-1142]
Ligand
BDBM400560
Substrate
Meas. Tech.
In vitro JAK Kinase Assay
IC50
<5.00±n/a nM
Citation
 Huang, TXue, C Piperidin-4-yl azetidine derivatives as JAK1 inhibitors US Patent  US10695337 Publication Date 6/30/2020 
Target
Name:
Tyrosine-protein kinase JAK1 [837-1142]
Synonyms:
JAK1 JAK1A JAK1_HUMAN Tyrosine-protein kinase JAK1 (837-1142) | Tyrosine-protein kinase JAK1 (aa 837-1142)
Type:
Mol. Mass.:
35230.04
Organism:
Homo sapiens (Human)
Description:
P23458[837-1142]
Residue:
306
  
Inhibitor
Name:
BDBM400560
Synonyms:
US10695337, Example 316 US9999619, Example 316
Type:
Small organic molecule
Emp. Form.:
C28H24F2N8O
Mol. Mass.:
526.54
SMILES:
Fc1cc(cc(c1)C(=O)N1CCC(CC1)N1CC(CC#N)(C1)n1cc(cn1)-c1c(F)cnc2[nH]ccc12)C#N
: