Target
Rho-associated protein kinase 1
Ligand
BDBM448494
Substrate
Meas. Tech.
ELISA Assay
IC50
550±n/a nM
Citation
 Chen, CChen, YHuang, JHuang, KLiu, CHwang, C Compounds for inhibiting AGC kinase and pharmaceutical compositions comprising the same US Patent  US10696638 Publication Date 6/30/2020 
Target
Name:
Rho-associated protein kinase 1
Synonyms:
ROCK-I ROCK1_HUMAN Rho-associated protein kinase Rho-associated, coiled-coil-containing protein kinase 1 Rho-kinase (ROCK I) p160 ROCK-1 | p160ROCK
Type:
Serine/threonine-protein kinase
Mol. Mass.:
158156.77
Organism:
Homo sapiens (Human)
Description:
Q13464
Residue:
1354
  
Inhibitor
Name:
BDBM448494
Synonyms:
US10696638, formula (I) 8
Type:
Small organic molecule
Emp. Form.:
C19H19FN4O
Mol. Mass.:
338.3788
SMILES:
NCCN(Cc1ccc(F)cc1)C(=O)Nc1ccc2cnccc2c1
: