Target
CREB-binding protein
Ligand
BDBM448547
Substrate
Meas. Tech.
TR FRET Binding Assay
IC50
1750±n/a nM
Citation
 Cyr, PBronner, SRomero, FAMagnuson, STsui, VHWai, JLai, KWWang, F Therapeutic compounds and uses thereof US Patent  US10696655 Publication Date 6/30/2020 
Target
Name:
CREB-binding protein
Synonyms:
CBP CREB-binding protein (CBP) CREBBP
Type:
Transcription Coactivator
Mol. Mass.:
265411.66
Organism:
Homo sapiens (Human)
Description:
Q92793
Residue:
2442
  
Inhibitor
Name:
BDBM448547
Synonyms:
US10696655, Example 20 | US11168070, Example 20
Type:
Small organic molecule
Emp. Form.:
C25H26F2N4O
Mol. Mass.:
436.4969
SMILES:
CN1C(=O)C(C)(C)c2ccc(cc12)N1CCCc2cc(-c3cnn(C)c3)c(cc12)C(F)F
: