Target
CREB-binding protein
Ligand
BDBM448594
Substrate
Meas. Tech.
TR FRET Binding Assay
IC50
5.00±n/a nM
Citation
 Cyr, PBronner, SRomero, FAMagnuson, STsui, VHWai, JLai, KWWang, F Therapeutic compounds and uses thereof US Patent  US10696655 Publication Date 6/30/2020 
Target
Name:
CREB-binding protein
Synonyms:
CBP CREB-binding protein (CBP) CREBBP
Type:
Transcription Coactivator
Mol. Mass.:
265411.66
Organism:
Homo sapiens (Human)
Description:
Q92793
Residue:
2442
  
Inhibitor
Name:
BDBM448594
Synonyms:
US10696655, Example 65 | US11168070, Example 65
Type:
Small organic molecule
Emp. Form.:
C23H22F2N6O
Mol. Mass.:
436.4572
SMILES:
CNC(=O)c1c[nH]c2ccc(nc12)N1CCCc2cc(-c3cnn(C)c3)c(cc12)C(F)F
: