Target
CREB-binding protein
Ligand
BDBM448600
Substrate
Meas. Tech.
TR FRET Binding Assay
IC50
187±n/a nM
Citation
 Cyr, PBronner, SRomero, FAMagnuson, STsui, VHWai, JLai, KWWang, F Therapeutic compounds and uses thereof US Patent  US10696655 Publication Date 6/30/2020 
Target
Name:
CREB-binding protein
Synonyms:
CBP CREB-binding protein (CBP) CREBBP
Type:
Transcription Coactivator
Mol. Mass.:
265411.66
Organism:
Homo sapiens (Human)
Description:
Q92793
Residue:
2442
  
Inhibitor
Name:
BDBM448600
Synonyms:
US10696655, Example 71 | US11168070, Example 71
Type:
Small organic molecule
Emp. Form.:
C22H21F2N7O
Mol. Mass.:
437.4452
SMILES:
CNC(=O)c1n[nH]c2ccc(nc12)N1CCCc2cc(-c3cnn(C)c3)c(cc12)C(F)F
: