Target
CREB-binding protein
Ligand
BDBM448601
Substrate
Meas. Tech.
TR FRET Binding Assay
IC50
110±n/a nM
Citation
 Cyr, PBronner, SRomero, FAMagnuson, STsui, VHWai, JLai, KWWang, F Therapeutic compounds and uses thereof US Patent  US10696655 Publication Date 6/30/2020 
Target
Name:
CREB-binding protein
Synonyms:
CBP CREB-binding protein (CBP) CREBBP
Type:
Transcription Coactivator
Mol. Mass.:
265411.66
Organism:
Homo sapiens (Human)
Description:
Q92793
Residue:
2442
  
Inhibitor
Name:
BDBM448601
Synonyms:
6-(7-(difluoromethyl)-6-(1-methyl-1H-pyrazol-4-yl)-3,4-dihydroquinolin-1(2H)-yl)-N-methylimidazo[1,2-b]pyridazine-3-carboxamide | US10696655, Example 72
Type:
Small organic molecule
Emp. Form.:
C22H21F2N7O
Mol. Mass.:
437.4452
SMILES:
CNC(=O)c1cnc2ccc(nn12)N1CCCc2cc(-c3cnn(C)c3)c(cc12)C(F)F
: