Target
CREB-binding protein
Ligand
BDBM448624
Substrate
Meas. Tech.
TR FRET Binding Assay
IC50
32.0±n/a nM
Citation
 Cyr, PBronner, SRomero, FAMagnuson, STsui, VHWai, JLai, KWWang, F Therapeutic compounds and uses thereof US Patent  US10696655 Publication Date 6/30/2020 
Target
Name:
CREB-binding protein
Synonyms:
CBP CREB-binding protein (CBP) CREBBP
Type:
Transcription Coactivator
Mol. Mass.:
265411.66
Organism:
Homo sapiens (Human)
Description:
Q92793
Residue:
2442
  
Inhibitor
Name:
BDBM448624
Synonyms:
6-[7-(difluoromethyl)-6-(1-methylpyrazol-4-yl)-3,4-dihydro-2H-quinolin-1-yl]-1-methyl-indolin-2-one US11168070, Example 90
Type:
Small organic molecule
Emp. Form.:
C23H22F2N4O
Mol. Mass.:
408.4438
SMILES:
CN1C(=O)Cc2ccc(cc12)N1CCCc2cc(-c3cnn(C)c3)c(cc12)C(F)F
: