Target
CREB-binding protein
Ligand
BDBM448635
Substrate
Meas. Tech.
TR FRET Binding Assay
IC50
12.0±n/a nM
Citation
 Cyr, PBronner, SRomero, FAMagnuson, STsui, VHWai, JLai, KWWang, F Therapeutic compounds and uses thereof US Patent  US10696655 Publication Date 6/30/2020 
Target
Name:
CREB-binding protein
Synonyms:
CBP CREB-binding protein (CBP) CREBBP
Type:
Transcription Coactivator
Mol. Mass.:
265411.66
Organism:
Homo sapiens (Human)
Description:
Q92793
Residue:
2442
  
Inhibitor
Name:
BDBM448635
Synonyms:
6-(7-(difluoromethyl)-6-(1-methyl-1H-pyrazol-4-yl)-3,4-dihydroquinolin-1(2H)-yl)-4-ethynyl-1,3-dimethyl-1H-benzo[d]imidazol-2(3H)-one US11168070, Example 101
Type:
Small organic molecule
Emp. Form.:
C25H23F2N5O
Mol. Mass.:
447.4798
SMILES:
Cn1cc(cn1)-c1cc2CCCN(c3cc(C#C)c4n(C)c(=O)n(C)c4c3)c2cc1C(F)F
: