Target
CREB-binding protein
Ligand
BDBM448642
Substrate
Meas. Tech.
TR FRET Binding Assay
IC50
31.0±n/a nM
Citation
 Cyr, PBronner, SRomero, FAMagnuson, STsui, VHWai, JLai, KWWang, F Therapeutic compounds and uses thereof US Patent  US10696655 Publication Date 6/30/2020 
Target
Name:
CREB-binding protein
Synonyms:
CBP CREB-binding protein (CBP) CREBBP
Type:
Transcription Coactivator
Mol. Mass.:
265411.66
Organism:
Homo sapiens (Human)
Description:
Q92793
Residue:
2442
  
Inhibitor
Name:
BDBM448642
Synonyms:
5-(7-(difluoromethyl)-6-(1-methyl-1H-pyrazol-4-yl)-3,4-dihydroquinolin-1(2H)-yl)-7-isopropyl-N,1-dimethyl-1H-indole-3-carboxamide US11168070, Example 108
Type:
Small organic molecule
Emp. Form.:
C28H31F2N5O
Mol. Mass.:
491.5754
SMILES:
CNC(=O)c1cn(C)c2c(cc(cc12)N1CCCc2cc(-c3cnn(C)c3)c(cc12)C(F)F)C(C)C
: