Target
CREB-binding protein
Ligand
BDBM448653
Substrate
Meas. Tech.
TR FRET Binding Assay
IC50
34.0±n/a nM
Citation
 Cyr, PBronner, SRomero, FAMagnuson, STsui, VHWai, JLai, KWWang, F Therapeutic compounds and uses thereof US Patent  US10696655 Publication Date 6/30/2020 
Target
Name:
CREB-binding protein
Synonyms:
CBP CREB-binding protein (CBP) CREBBP
Type:
Transcription Coactivator
Mol. Mass.:
265411.66
Organism:
Homo sapiens (Human)
Description:
Q92793
Residue:
2442
  
Inhibitor
Name:
BDBM448653
Synonyms:
4-(7-(difluoromethyl)-6-(1-methyl-1H-pyrazol-4-yl)-3,4-dihydroquinolin-1(2H)-yl)-N-methylisoquinoline-6-carboxamide US11168070, Example 119
Type:
Small organic molecule
Emp. Form.:
C25H23F2N5O
Mol. Mass.:
447.4798
SMILES:
CNC(=O)c1ccc2cncc(N3CCCc4cc(-c5cnn(C)c5)c(cc34)C(F)F)c2c1
: