Target
Free fatty acid receptor 1
Ligand
BDBM168166
Substrate
Meas. Tech.
Calcium Flux Assay
Temperature
298.15±n/a K
EC50
5.00±n/a nM
Comments
extracted
Citation
 PubChem, PCMeegalla, SHuang, HPlayer, MR Substituted pyrazines as GPR40 agonists US Patent  US9688642 Publication Date 6/27/2017 
Target
Name:
Free fatty acid receptor 1
Synonyms:
FFAR1 G-protein Coupled Receptor 40 | GPR40
Type:
G Protein-Coupled Receptor (GPCR)
Mol. Mass.:
31473.32
Organism:
Homo sapiens (Human)
Description:
O14842
Residue:
300
  
Inhibitor
Name:
BDBM168166
Synonyms:
US9688642, 6
Type:
Small organic molecule
Emp. Form.:
C30H32FN3O4
Mol. Mass.:
517.5912
SMILES:
COc1ccc(F)c(c1)-c1ncc(COc2cccc(c2)[C@@H](CC(O)=O)C2CC2)nc1N1CC2(CCC2)C1
: