Target
Free fatty acid receptor 1
Ligand
BDBM298462
Substrate
EC50
10.00±n/a nM
Citation
 Eckhardt, MWagner, HPeters, S Indanylaminopyridylcyclopropanecarboxylic acids, pharmaceutical compositions and uses thereof US Patent  US10125101 Publication Date 11/13/2018 
Target
Name:
Free fatty acid receptor 1
Synonyms:
FFAR1 G-protein Coupled Receptor 40 | GPR40
Type:
G Protein-Coupled Receptor (GPCR)
Mol. Mass.:
31473.32
Organism:
Homo sapiens (Human)
Description:
O14842
Residue:
300
  
Inhibitor
Name:
BDBM298462
Synonyms:
US10125101, Example 12
Type:
Small organic molecule
Emp. Form.:
C30H31FN2O4
Mol. Mass.:
502.5765
SMILES:
Cc1cc(O[C@@H]2CCOC2)cc(C)c1-c1ccc(F)c2[C@@H](CCc12)Nc1ccc(nc1)[C@H]1C[C@@H]1C(O)=O
: