Target
Cytochrome P450 2C8
Ligand
BDBM298458
Substrate
Meas. Tech.
Inhibition of CYP-2C8
IC50
>50000±n/a nM
Citation
 Eckhardt, MWagner, HPeters, S Indanylaminopyridylcyclopropanecarboxylic acids, pharmaceutical compositions and uses thereof US Patent  US10125101 Publication Date 11/13/2018 
Target
Name:
Cytochrome P450 2C8
Synonyms:
CP2C8_HUMAN CYPIIC8 P450 IIC2 P450 form 1 | S-mephenytoin 4-hydroxylase
Type:
Protein
Mol. Mass.:
55839.23
Organism:
Homo sapiens (Human)
Description:
P10632
Residue:
490
  
Inhibitor
Name:
BDBM298458
Synonyms:
(1S,2S)-2-{5-[(R)-4-(3-Fluoro-4-methoxy-phenyl)-indan-1-ylamino]-pyridin-2-yl}-cyclopropanecarboxylic acid | US10125101, Example 8
Type:
Small organic molecule
Emp. Form.:
C25H23FN2O3
Mol. Mass.:
418.4601
SMILES:
COc1ccc(cc1F)-c1cccc2[C@@H](CCc12)Nc1ccc(nc1)[C@H]1C[C@@H]1C(O)=O
: