Target
Cytochrome P450 2C9
Ligand
BDBM298469
Substrate
Meas. Tech.
Inhibition of CYP-2C9
IC50
26000±n/a nM
Citation
 Eckhardt, MWagner, HPeters, S Indanylaminopyridylcyclopropanecarboxylic acids, pharmaceutical compositions and uses thereof US Patent  US10125101 Publication Date 11/13/2018 
Target
Name:
Cytochrome P450 2C9
Synonyms:
(R)-limonene 6-monooxygenase CP2C9_HUMAN CYP2C9 Cytochrome P450 2C9 (CYP2C9 ) P-450MP P450 PB-1 | S-mephenytoin 4-hydroxylase
Type:
Enzyme
Mol. Mass.:
55636.33
Organism:
Homo sapiens (Human)
Description:
P11712
Residue:
490
  
Inhibitor
Name:
BDBM298469
Synonyms:
US10125101, Example 19
Type:
Small organic molecule
Emp. Form.:
C30H29FN4O2
Mol. Mass.:
496.5753
SMILES:
Cc1cc(cc(C)c1-c1ccc(F)c2[C@@H](CCc12)Nc1ccc(nc1)[C@H]1C[C@@H]1C(O)=O)-c1ccnn1C
: