Target
SRSF protein kinase 1
Ligand
BDBM448684
Substrate
Meas. Tech.
Inhibition Assay
IC50
12.7±n/a nM
Citation
 Bates, DMorris, JToop, HBatson, JMorley, AD Compounds US Patent  US10696661 Publication Date 6/30/2020 
Target
Name:
SRSF protein kinase 1
Synonyms:
SRPK1 SRSF protein kinase 1 (SRPK1) Serine/threonine-protein kinase SRPK1
Type:
Protein
Mol. Mass.:
74318.38
Organism:
Homo sapiens (Human)
Description:
Q96SB4
Residue:
655
  
Inhibitor
Name:
BDBM448684
Synonyms:
N-(2-(4-((1H-pyrazol-3-yl)methyl)piperazin-1-yl)-5- (trifluoromethyl)-phenyl)picolinamide | US10696661, Compound 33
Type:
Small organic molecule
Emp. Form.:
C21H21F3N6O
Mol. Mass.:
430.4262
SMILES:
FC(F)(F)c1ccc(N2CCN(Cc3cc[nH]n3)CC2)c(NC(=O)c2ccccn2)c1
: