Target
SRSF protein kinase 1
Ligand
BDBM448707
Substrate
Meas. Tech.
Inhibition Assay
IC50
344±n/a nM
Citation
 Bates, DMorris, JToop, HBatson, JMorley, AD Compounds US Patent  US10696661 Publication Date 6/30/2020 
Target
Name:
SRSF protein kinase 1
Synonyms:
SRPK1 SRSF protein kinase 1 (SRPK1) Serine/threonine-protein kinase SRPK1
Type:
Protein
Mol. Mass.:
74318.38
Organism:
Homo sapiens (Human)
Description:
Q96SB4
Residue:
655
  
Inhibitor
Name:
BDBM448707
Synonyms:
N-(2-(4-(oxazol-4-ylmethyl)piperazin-1-yl)-5-(trifluoro- methyl)phenyl)pyrimidine-2-carboxamide | US10696661, Compound 54
Type:
Small organic molecule
Emp. Form.:
C20H19F3N6O2
Mol. Mass.:
432.3991
SMILES:
FC(F)(F)c1ccc(N2CCN(Cc3cocn3)CC2)c(NC(=O)c2ncccn2)c1
: