Target
SRSF protein kinase 1
Ligand
BDBM448715
Substrate
Meas. Tech.
Inhibition Assay
IC50
2.80±n/a nM
Citation
 Bates, DMorris, JToop, HBatson, JMorley, AD Compounds US Patent  US10696661 Publication Date 6/30/2020 
Target
Name:
SRSF protein kinase 1
Synonyms:
SRPK1 SRSF protein kinase 1 (SRPK1) Serine/threonine-protein kinase SRPK1
Type:
Protein
Mol. Mass.:
74318.38
Organism:
Homo sapiens (Human)
Description:
Q96SB4
Residue:
655
  
Inhibitor
Name:
BDBM448715
Synonyms:
N-(2-(4-(isoxazol-5-ylmethyl)piperazin-1-yl)-5-(trifluoro- methyl)phenyl)picolinamide | US10696661, Compound 62
Type:
Small organic molecule
Emp. Form.:
C21H20F3N5O2
Mol. Mass.:
431.411
SMILES:
FC(F)(F)c1ccc(N2CCN(Cc3ccno3)CC2)c(NC(=O)c2ccccn2)c1
: