Target
Isocitrate dehydrogenase [NADP] cytoplasmic [R132C]
Ligand
BDBM448735
Substrate
Meas. Tech.
Biochemical Assay
IC50
210±n/a nM
Citation
 Lumeras Amador, WBoulet, SLBurkholder, TPCarballares Martin, SGilmour, RHahn, PJBauer, RARankovic, Z Mutant IDH1 inhibitors US Patent  US10696665 Publication Date 6/30/2020 
Target
Name:
Isocitrate dehydrogenase [NADP] cytoplasmic [R132C]
Synonyms:
IDH1 IDH1(R132C) Isocitrate dehydrogenase (IDH1)(R132C) Isocitrate dehydrogenase [NADP] cytoplasmic (IDH1) (R132C) | PICD
Type:
Enzyme Catalytic Domain
Mol. Mass.:
46607.23
Organism:
Homo sapiens (Human)
Description:
O75874[R132C]
Residue:
414
  
Inhibitor
Name:
BDBM448735
Synonyms:
(S)-3-(2-(((S)-1-(4-((4- acryloylpiperazin-1- yl)methyl)phenyl)ethyl) amino)pyrimidin-4-yl)- 4-methyloxazolidin-2-one | US10696665, Example 3
Type:
Small organic molecule
Emp. Form.:
C24H30N6O3
Mol. Mass.:
450.5334
SMILES:
C[C@H](Nc1nccc(n1)N1[C@@H](C)COC1=O)c1ccc(CN2CCN(CC2)C(=O)C=C)cc1
: