Target
Isocitrate dehydrogenase [NADP] cytoplasmic
Ligand
BDBM448734
Substrate
Meas. Tech.
Biochemical Assay
IC50
3150±70 nM
Citation
 Lumeras Amador, WBoulet, SLBurkholder, TPCarballares Martin, SGilmour, RHahn, PJBauer, RARankovic, Z Mutant IDH1 inhibitors US Patent  US10696665 Publication Date 6/30/2020 
Target
Name:
Isocitrate dehydrogenase [NADP] cytoplasmic
Synonyms:
Cytosolic NADP-isocitrate dehydrogenase IDH1 IDP Isocitrate dehydrogenase 1 (IDH1) Oxalosuccinate decarboxylase | PICD
Type:
Protein
Mol. Mass.:
46661.29
Organism:
Homo sapiens (Human)
Description:
O75874
Residue:
414
  
Inhibitor
Name:
BDBM448734
Synonyms:
(S)-3-(2-(((S)-1-(4-((4- acryloylpiperazin-1- yl)methyl)phenyl)ethyl) amino)pyrimidin-4-yl)- 4-ethyloxazolidin-2-one | US10696665, Example 2
Type:
Small organic molecule
Emp. Form.:
C25H32N6O3
Mol. Mass.:
464.56
SMILES:
CC[C@H]1COC(=O)N1c1ccnc(N[C@@H](C)c2ccc(CN3CCN(CC3)C(=O)C=C)cc2)n1
: