Target
Integrin alpha-V/beta-6
Ligand
BDBM448800
Substrate
Meas. Tech.
Binding Assay
IC50
>1000±n/a nM
Citation
 Morgans, Jr., DJHalcomb, RLBergnes, GLi, HJiang, LCha, JHom, T Amino acid compounds and methods of use US Patent  US10696672 Publication Date 6/30/2020 
Target
Name:
Integrin alpha-V/beta-6
Synonyms:
ITGAV/ITGB6 Integrin alpha-v/beata-6 Integrin beta-6/Vitronectin receptor alpha
Type:
Enzyme
Mol. Mass.:
Description:
Components:
This complex has 2 components.
Component 1
Name:
Integrin alpha-V
Synonyms:
ITAV_HUMAN Integrin alpha-V/alpha-5 VNRA Vitronectin receptor | Vitronectin receptor subunit alpha
Type:
PROTEIN
Mol. Mass.:
116024.92
Organism:
Homo sapiens (Human)
Description:
ChEMBL_582336
Residue:
1048
  
Component 2
Name:
Integrin beta-6
Synonyms:
ITB6_HUMAN | ITGB6
Type:
PROTEIN
Mol. Mass.:
85919.61
Organism:
Homo sapiens (Human)
Description:
EBI_10916
Residue:
788
  
Inhibitor
Name:
BDBM448800
Synonyms:
US10696672, Compound 33 US11634418, Compound 33
Type:
Small organic molecule
Emp. Form.:
C25H35F2N5O4
Mol. Mass.:
507.5733
SMILES:
OC(=O)[C@H](CCN1CCC(CC1)NC(=O)c1ccc2CCCNc2n1)NC(=O)C1CCC(F)(F)CC1
: