Target
Cyclin-dependent kinase 4/G1/S-specific cyclin-D3
Ligand
BDBM50455064
Substrate
Meas. Tech.
Inhibition Assay
IC50
16000±n/a nM
Citation
 Liu, WYin, LLi, H Kinase inhibitor, and preparing method and pharmaceutical use thereof US Patent  US10696678 Publication Date 6/30/2020 
Target
Name:
Cyclin-dependent kinase 4/G1/S-specific cyclin-D3
Synonyms:
CDK4/Cyclin D3
Type:
Mol. Mass.:
Description:
ASSAY_ID of ChEMBL is 1806445
Components:
This complex has 2 components.
Component 1
Name:
Cyclin-dependent kinase 4
Synonyms:
CDK4 Cell division protein kinase 4 PSK-J3
Type:
Enzyme Subunit
Mol. Mass.:
33731.96
Organism:
Homo sapiens (Human)
Description:
P11802
Residue:
303
  
Component 2
Name:
G1/S-specific cyclin-D3
Synonyms:
CCND3 | CCND3_HUMAN
Type:
Enzyme
Mol. Mass.:
32521.90
Organism:
Homo sapiens (Human)
Description:
P30281
Residue:
292
  
Inhibitor
Name:
BDBM50455064
Synonyms:
CHEMBL4211479 | US10696678, Example 37
Type:
Small organic molecule
Emp. Form.:
C29H34F2N8
Mol. Mass.:
532.6307
SMILES:
CCN1CCN(Cc2ccc(Nc3ncc(F)c(n3)-c3cc(F)c4nc5CCC(C)(C)n5c4c3)nc2C)CC1
: