Target
Cyclin-dependent kinase 6/G1/S-specific cyclin-D3
Ligand
BDBM448945
Substrate
Meas. Tech.
Inhibition Assay
IC50
200±n/a nM
Citation
 Liu, WYin, LLi, H Kinase inhibitor, and preparing method and pharmaceutical use thereof US Patent  US10696678 Publication Date 6/30/2020 
Target
Name:
Cyclin-dependent kinase 6/G1/S-specific cyclin-D3
Synonyms:
CDK6/CycD3 CDK6/G1/S-specific cyclin D3 Cyclin-dependent kinase 6 | Cyclin-dependent kinase 6/G1/S-specific cyclin D3
Type:
Protein
Mol. Mass.:
Description:
Components:
This complex has 2 components.
Component 1
Name:
Cyclin-dependent kinase 6
Synonyms:
CDK6 CDKN6 Cyclin-dependent kinase 6 (CDK 6) | Serine/threonine-protein kinase PLSTIRE
Type:
Enzyme Subunit
Mol. Mass.:
36937.42
Organism:
Homo sapiens (Human)
Description:
Q00534
Residue:
326
  
Component 2
Name:
G1/S-specific cyclin-D3
Synonyms:
CCND3 | CCND3_HUMAN
Type:
Enzyme
Mol. Mass.:
32521.90
Organism:
Homo sapiens (Human)
Description:
P30281
Residue:
292
  
Inhibitor
Name:
BDBM448945
Synonyms:
(R)-5-Fluoro-4-(5-fluoro-1,1-dimethyl-2,3-dihydro-1H-benzo[d]pyrrolo[1,2-a]imidazol-7-yl)-N-(5-(3-methylpiperazin-1-yl)pyridin-2-yl)pyrimidin-2-amine | US10696678, Example 40
Type:
Small organic molecule
Emp. Form.:
C26H28F2N8
Mol. Mass.:
490.5509
SMILES:
C[C@@H]1CN(CCN1)c1ccc(Nc2ncc(F)c(n2)-c2cc(F)c3nc4CCC(C)(C)n4c3c2)nc1
: