Target
Cyclin-dependent kinase 4/G1/S-specific cyclin-D3
Ligand
BDBM448957
Substrate
Meas. Tech.
Inhibition Assay
IC50
60700±n/a nM
Citation
 Liu, WYin, LLi, H Kinase inhibitor, and preparing method and pharmaceutical use thereof US Patent  US10696678 Publication Date 6/30/2020 
Target
Name:
Cyclin-dependent kinase 4/G1/S-specific cyclin-D3
Synonyms:
CDK4/Cyclin D3
Type:
Mol. Mass.:
Description:
ASSAY_ID of ChEMBL is 1806445
Components:
This complex has 2 components.
Component 1
Name:
Cyclin-dependent kinase 4
Synonyms:
CDK4 Cell division protein kinase 4 PSK-J3
Type:
Enzyme Subunit
Mol. Mass.:
33731.96
Organism:
Homo sapiens (Human)
Description:
P11802
Residue:
303
  
Component 2
Name:
G1/S-specific cyclin-D3
Synonyms:
CCND3 | CCND3_HUMAN
Type:
Enzyme
Mol. Mass.:
32521.90
Organism:
Homo sapiens (Human)
Description:
P30281
Residue:
292
  
Inhibitor
Name:
BDBM448957
Synonyms:
4-(2-Ethyl-5-fluoro-2,3-dihydro-1H-benzo[d]pyrrolo[1,2-a]imidazol-7-yl)-5-fluoro-N-(5-(piperazin-1-yl)pyridin-2-yl)pyrimidin-2-amine | US10696678, Example 52
Type:
Small organic molecule
Emp. Form.:
C25H26F2N8
Mol. Mass.:
476.5243
SMILES:
CCC1Cc2nc3c(F)cc(cc3n2C1)-c1nc(Nc2ccc(cn2)N2CCNCC2)ncc1F
: