Target
Cyclin-dependent kinase 6/G1/S-specific cyclin-D3
Ligand
BDBM448973
Substrate
Meas. Tech.
Inhibition Assay
IC50
6000±n/a nM
Citation
 Liu, WYin, LLi, H Kinase inhibitor, and preparing method and pharmaceutical use thereof US Patent  US10696678 Publication Date 6/30/2020 
Target
Name:
Cyclin-dependent kinase 6/G1/S-specific cyclin-D3
Synonyms:
CDK6/CycD3 CDK6/G1/S-specific cyclin D3 Cyclin-dependent kinase 6 | Cyclin-dependent kinase 6/G1/S-specific cyclin D3
Type:
Protein
Mol. Mass.:
Description:
Components:
This complex has 2 components.
Component 1
Name:
Cyclin-dependent kinase 6
Synonyms:
CDK6 CDKN6 Cyclin-dependent kinase 6 (CDK 6) | Serine/threonine-protein kinase PLSTIRE
Type:
Enzyme Subunit
Mol. Mass.:
36937.42
Organism:
Homo sapiens (Human)
Description:
Q00534
Residue:
326
  
Component 2
Name:
G1/S-specific cyclin-D3
Synonyms:
CCND3 | CCND3_HUMAN
Type:
Enzyme
Mol. Mass.:
32521.90
Organism:
Homo sapiens (Human)
Description:
P30281
Residue:
292
  
Inhibitor
Name:
BDBM448973
Synonyms:
4-(1-Ethyl-5-fluoro-2,3-dihydro-1H-benzo[d]pyrrolo[1,2-a]imidazolel-7-yl)-5-fluoro-N-(5-(1-methylpiperidine-4-yl)pyridin-2-yl)pyrimidin-2-amine | US10696678, Example 68
Type:
Small organic molecule
Emp. Form.:
C27H29F2N7
Mol. Mass.:
489.5629
SMILES:
CCC1CCc2nc3c(F)cc(cc3n12)-c1nc(Nc2ccc(cn2)C2CCN(C)CC2)ncc1F
: