Target
Cyclin-dependent kinase 2/G1/S-specific cyclin-E1
Ligand
BDBM448991
Substrate
Meas. Tech.
Biological Activity Assay
IC50
50500±n/a nM
Citation
 Tavares, FXStrum, JC CDK inhibitors US Patent  US10696682 Publication Date 6/30/2020 
Target
Name:
Cyclin-dependent kinase 2/G1/S-specific cyclin-E1
Synonyms:
CDK2/CycE CDK2/E Cyclin-Dependent Kinase 2 (CDK2) Cyclin-dependent kinase 2/cyclin E1
Type:
Protein
Mol. Mass.:
Description:
Components:
This complex has 2 components.
Component 1
Name:
Cyclin-dependent kinase 2
Synonyms:
CDK2 CDK2_HUMAN Cell division protein kinase 2 Protein cereblon/Cyclin-dependent kinase 2 | p33 protein kinase
Type:
Enzyme Subunit
Mol. Mass.:
33938.17
Organism:
Homo sapiens (Human)
Description:
P24941
Residue:
298
  
Component 2
Name:
G1/S-specific cyclin-E1
Synonyms:
CCNE CCNE1_HUMAN
Type:
Enzyme Subunit
Mol. Mass.:
47073.17
Organism:
Homo sapiens (Human)
Description:
Residue:
410
  
Inhibitor
Name:
BDBM448991
Synonyms:
US10696682, Compound 21
Type:
Small organic molecule
Emp. Form.:
C23H32N8O
Mol. Mass.:
436.5532
SMILES:
CN1C[C@@H](N2C3N=C(Nc4ccc(cn4)N4CCNCC4)N=CC3C=C2C1=O)C(C)(C)C
: