Target
Somatostatin receptor type 2
Ligand
BDBM448916
Substrate
Meas. Tech.
cAMP Assay
EC50
<0.1±n/a nM
Citation
 Han, SKim, SHZhu, Y Somatostatin modulators and uses thereof US Patent  US10696689 Publication Date 6/30/2020 
Target
Name:
Somatostatin receptor type 2
Synonyms:
SOMATOSTATIN SST2 SS-2-R SS2R SSTR2 | Somatostatin receptor type 2 (SSTR2)
Type:
Enzyme
Mol. Mass.:
41344.94
Organism:
Homo sapiens (Human)
Description:
P30874
Residue:
369
  
Inhibitor
Name:
BDBM448916
Synonyms:
US10696689, Compound 1-1
Type:
Small organic molecule
Emp. Form.:
C26H26FN7O
Mol. Mass.:
471.5293
SMILES:
COc1cc(cc2[nH]c(nc12)-c1c(N)ncc(-c2cc(C)cc(F)c2)c1N1CCC(N)CC1)C#N
: