Target
Nicotinamide phosphoribosyltransferase
Ligand
BDBM449048
Substrate
Meas. Tech.
Enzymatic Reaction Assay
IC50
4.60±n/a nM
Citation
 Bair, KWBaumeister, TRBuckmelter, AJClodfelter, KHDragovich, PGosselin, FGunzner-Toste, JHan, BLin, JLiu, XReynolds, DJSmith, CCWang, ZZak, MZhang, YZhao, GZheng, XYuen, P Amido-benzyl sulfone and sulfoxide derivates US Patent  US10696692 Publication Date 6/30/2020 
Target
Name:
Nicotinamide phosphoribosyltransferase
Synonyms:
NAMPT NAmPRTase Nicotinamide phosphoribosyltransferase (NAMPT) PBEF1 | Pre-B-cell colony-enhancing factor 1
Type:
Enzyme
Mol. Mass.:
55524.98
Organism:
Homo sapiens (Human)
Description:
P43490
Residue:
491
  
Inhibitor
Name:
BDBM449048
Synonyms:
Imidazo[1,2-a]pyrimidine- 6-carboxylic acid 4-(8- oxa-3-aza- bicyclo[3.2.1]octane-3- sulfonyl)-benzylamide | US10696692, Example 26
Type:
Small organic molecule
Emp. Form.:
C20H21N5O4S
Mol. Mass.:
427.477
SMILES:
O=C(NCc1ccc(cc1)S(=O)(=O)N1CC2CCC(C1)O2)c1cnc2nccn2c1
: