Target
Nicotinamide phosphoribosyltransferase
Ligand
BDBM449095
Substrate
Meas. Tech.
Enzymatic Reaction Assay
IC50
5.00±n/a nM
Citation
 Bair, KWBaumeister, TRBuckmelter, AJClodfelter, KHDragovich, PGosselin, FGunzner-Toste, JHan, BLin, JLiu, XReynolds, DJSmith, CCWang, ZZak, MZhang, YZhao, GZheng, XYuen, P Amido-benzyl sulfone and sulfoxide derivates US Patent  US10696692 Publication Date 6/30/2020 
Target
Name:
Nicotinamide phosphoribosyltransferase
Synonyms:
NAMPT NAmPRTase Nicotinamide phosphoribosyltransferase (NAMPT) PBEF1 | Pre-B-cell colony-enhancing factor 1
Type:
Enzyme
Mol. Mass.:
55524.98
Organism:
Homo sapiens (Human)
Description:
P43490
Residue:
491
  
Inhibitor
Name:
BDBM449095
Synonyms:
US10696692, Example 73 cis-Imidazo[1,2- a]pyridine-6-carboxylic acid 4-(4,4-difluoro- hexahydro- cyclopenta[c]pyrrole-2- sulfonyl)-benzylamide (isomer A)
Type:
Small organic molecule
Emp. Form.:
C22H22F2N4O3S
Mol. Mass.:
460.497
SMILES:
FC1(F)CCC2CN(CC12)S(=O)(=O)c1ccc(CNC(=O)c2ccc3nccn3c2)cc1
: