Target
Transcription intermediary factor 1-alpha
Ligand
BDBM449284
Substrate
Meas. Tech.
Alpha Assay
IC50
750±n/a nM
Citation
 Bradner, JBuckley, DGechijian, L Degradation of tripartite motif-containing protein 24 (TRIM24) by conjugation of TRIM24 inhibitors with E3 ligase ligand and methods of use US Patent  US10702504 Publication Date 7/7/2020 
Target
Name:
Transcription intermediary factor 1-alpha
Synonyms:
6.3.2.- RING finger protein 82 RNF82 TIF1-alpha TIF1A_HUMAN Transcription intermediary factor 1-alpha | Tripartite motif-containing protein 24
Type:
PROTEIN
Mol. Mass.:
116839.55
Organism:
Homo sapiens (Human)
Description:
ChEMBL_107998
Residue:
1050
  
Inhibitor
Name:
BDBM449284
Synonyms:
US10702504, Compound I-A9
Type:
Small organic molecule
Emp. Form.:
C47H55N9O15S
Mol. Mass.:
1018.056
SMILES:
Cc1nc(cn1C)S(=O)(=O)Nc1cc2n(C)c(=O)n(C)c2cc1Oc1cccc(OCC(=O)NCCCOCCOCCOCCCNC(=O)COc2cccc3C(=O)N(C4CCC(=O)NC4=O)C(=O)c23)c1
: