Target
Genome polyprotein
Ligand
BDBM298515
Substrate
Meas. Tech.
HCV Replicon Luciferase Assay
EC50
<100±n/a nM
Citation
 Wang, TYin, ZZhang, ZKadow, JF Benzofuran compounds for the treatment of hepatitis C US Patent  US10125111 Publication Date 11/13/2018 
Target
Name:
Genome polyprotein
Synonyms:
Genome polyprotein RNA polymerase (NS5B)
Type:
Enzyme
Mol. Mass.:
326966.11
Organism:
Hepatitis C virus (HCV)
Description:
Q9WMX2
Residue:
3010
  
Inhibitor
Name:
BDBM298515
Synonyms:
US10125111, Compound 3014
Type:
Small organic molecule
Emp. Form.:
C31H31F2N3O7S
Mol. Mass.:
627.656
SMILES:
CNC(=O)c1c(oc2cc(N(CCF)S(C)(=O)=O)c(cc12)-c1cccc(c1)C(=O)NC(C)(C)C(=O)OC)-c1ccc(F)cc1
: