Target
Genome polyprotein
Ligand
BDBM298588
Substrate
Meas. Tech.
HCV Replicon Luciferase Assay
EC50
<100±n/a nM
Citation
 Wang, TYin, ZZhang, ZKadow, JF Benzofuran compounds for the treatment of hepatitis C US Patent  US10125111 Publication Date 11/13/2018 
Target
Name:
Genome polyprotein
Synonyms:
Genome polyprotein RNA polymerase (NS5B)
Type:
Enzyme
Mol. Mass.:
326966.11
Organism:
Hepatitis C virus (HCV)
Description:
Q9WMX2
Residue:
3010
  
Inhibitor
Name:
BDBM298588
Synonyms:
US10125111, Compound 8001
Type:
Small organic molecule
Emp. Form.:
C28H23F3N2O6S
Mol. Mass.:
572.552
SMILES:
CNC(=O)c1c(oc2cc(N(CC=C(F)F)S(C)(=O)=O)c(cc12)-c1cccc(c1)C(=O)OC)-c1ccc(F)cc1
: