Target
P2X purinoceptor 7
Ligand
BDBM254231
Substrate
Meas. Tech.
Radioligand Binding
Ki
6.30±n/a nM
Citation
 Alcazar Vaca, MJAndres Gil, JIChrovian, CCCoate, HRDe angelis, MDvorak, CAGelin, CFLetavic, MASavall, BMSoyode-Johnson, AStenne, BMSwanson, DM P2X7 modulators US Patent  US10703749 Publication Date 7/7/2020 
Target
Name:
P2X purinoceptor 7
Synonyms:
ATP receptor P2RX7_HUMAN P2X purinoceptor 7 (P2X7) P2Z receptor | Purinergic receptor
Type:
Protein
Mol. Mass.:
68602.85
Organism:
Homo sapiens (Human)
Description:
Q99572
Residue:
595
  
Inhibitor
Name:
BDBM254231
Synonyms:
US10112937, Example 116 US10703749, Example 116 | US9464084, 116
Type:
Small organic molecule
Emp. Form.:
C19H15ClF3N5O
Mol. Mass.:
421.804
SMILES:
CC1Cc2c(CN1C(=O)c1cccc(c1Cl)C(F)(F)F)nnn2-c1ccccn1
: