Target
P2X purinoceptor 7
Ligand
BDBM254364
Substrate
Meas. Tech.
Radioligand Binding
Ki
5.90±n/a nM
Citation
 Alcazar Vaca, MJAndres Gil, JIChrovian, CCCoate, HRDe angelis, MDvorak, CAGelin, CFLetavic, MASavall, BMSoyode-Johnson, AStenne, BMSwanson, DM P2X7 modulators US Patent  US10703749 Publication Date 7/7/2020 
Target
Name:
P2X purinoceptor 7
Synonyms:
ATP receptor P2RX7_HUMAN P2X purinoceptor 7 (P2X7) P2Z receptor | Purinergic receptor
Type:
Protein
Mol. Mass.:
68602.85
Organism:
Homo sapiens (Human)
Description:
Q99572
Residue:
595
  
Inhibitor
Name:
BDBM254364
Synonyms:
US10112937, Example 271 US10703749, Example 271 | US9464084, 271
Type:
Small organic molecule
Emp. Form.:
C18H14F4N6O
Mol. Mass.:
406.337
SMILES:
C[C@H]1N(CCc2c1nnn2-c1ncccn1)C(=O)c1cccc(c1F)C(F)(F)F
: