Target
Tyrosine-protein kinase JAK1 [850-1154]
Ligand
BDBM449875
Substrate
Meas. Tech.
Kinase Assay
EC50
10.8±n/a nM
Citation
 Larsen, JLarsen, MRasmussen, LKRitzen, ADuus, TM Amino-imidazopyridine derivatives as Janus kinase inhibitors and pharmaceutical use thereof US Patent  US10703751 Publication Date 7/7/2020 
Target
Name:
Tyrosine-protein kinase JAK1 [850-1154]
Synonyms:
JAK1 JAK1A JAK1_HUMAN
Type:
Enzyme Catalytic Domain
Mol. Mass.:
34949.64
Organism:
Homo sapiens (Human)
Description:
P23458[850-1154]
Residue:
305
  
Inhibitor
Name:
BDBM449875
Synonyms:
US10703751, Example 1 trans-2-[4-[2-[1-Hydroxyethyl]-6-(methylamino)imidazo[4,5-c]pyridin-1-yl]cyclohexyl]acetonitrile
Type:
Small organic molecule
Emp. Form.:
C17H23N5O
Mol. Mass.:
313.3974
SMILES:
CNc1cc2n([C@H]3CC[C@H](CC#N)CC3)c(nc2cn1)C(C)O
: